{"text_format":"1","workbook":"xlsx","n_sheets":3,"sheets":["様式2号（認証チェックシート）","公表用チェックシート","（非表示シート）BCI列プルダウン"],"not_rendered":{"charts":0,"images":26,"macros":1,"external_links":3,"defined_names":14,"comments":1,"pivot_tables":0},"unopened":[],"bounds":{"document_bytes":16777216,"sheet_cells":100000,"rows_first":2000,"rows_last":500,"rows_between":2000,"halvings":0,"cell_chars":16384,"cell_head_chars":4096},"cells_cut":0,"cells_raw":0,"read":"whole","date_system":"1900"}

{"sheet":"様式2号（認証チェックシート）","index":0,"n_rows":93,"n_cols":13,"rows_kept":93,"cut":false,"hidden":false,"merged":[[12,11,13,12],[13,4,13,5],[22,1,23,1],[22,2,23,2],[22,3,23,3],[20,3,21,3],[17,1,21,1],[17,2,21,2],[17,3,19,3],[14,1,16,1],[14,2,16,2],[14,3,15,3],[26,12,30,12],[24,1,25,1],[24,2,25,2],[24,3,25,3],[14,12,16,12],[31,1,32,1],[31,2,32,2],[31,3,32,3],[26,1,30,1],[26,2,30,2],[26,3,30,3],[40,1,44,1],[40,2,44,2],[33,1,39,1],[33,2,39,2],[33,3,35,3],[36,3,39,3],[40,3,43,3],[51,1,54,1],[51,2,54,2],[51,3,54,3],[45,1,50,1],[45,2,50,2],[45,3,47,3],[48,3,50,3],[57,1,59,1],[57,2,59,2],[57,3,59,3],[55,1,56,1],[55,2,56,2],[55,3,56,3],[64,1,67,1],[64,2,67,2],[64,3,67,3],[60,1,63,1],[60,2,63,2],[60,3,61,3],[62,3,63,3],[71,1,74,1],[71,2,74,2],[71,3,74,3],[68,1,70,1],[68,2,70,2],[68,3,70,3],[80,11,81,11],[80,12,81,12],[75,1,76,1],[75,2,76,2],[75,3,76,3],[2,1,2,13],[9,1,9,13],[90,1,92,1],[90,2,92,2],[90,3,92,3],[90,12,92,12],[86,1,89,1],[86,2,89,2],[87,3,89,3],[82,1,83,1],[82,2,83,2],[82,3,83,3],[77,1,81,1],[77,2,81,2],[77,3,79,3],[80,3,81,3]]}
[]
[]
[null,"豊田市SDGs認証　認証チェックシート"]
[]
[null,"豊田市の以下の制度のうち、表彰実績がある／参加しているものがありましたら、表彰を受けた年／参加した年をご記入ください。（複数回表彰実績がある場合は、直近の実績をご記入ください。）"]
[]
[null,null,"・豊田市はたらく人がイキイキ輝く事業所表彰",null,null,"【受賞の種類（チェック）　　　大賞　　　優秀賞　　　　イキイキ賞　　　　部門賞　表彰を受けた年：　　　　　　】　※令和３年度～令和５年度の受賞実績に限る"]
[null,null,"　※表彰による自動配点",null,null,"【　　希望する】 （自動配点を希望された場合、S1-S5のチェック／記述は一切不要となる代わり、一定の想定点数が付与されます）"]
[null,null,"・豊田市脱炭素スクール",null,null,"【　　修了実績がある　／修了した年：　　　　　　】"]
[null,"各評価項目について、実施している項目があればチェックをつけてください。（複数選択可）\nチェックを付けた取組について、具体的な取組内容やその実績などを「記述欄」にご記入ください（原則300文字以内）。なお、大項目やチェックの状況などによって、記述欄に記載が求められる内容は異なります。（【取得している認証】【取組の成果】　など）\n　　※複数の取組を実施している場合は、文字数制限の範囲内でなるべく複数の取組についてご記載ください。\n　　※【取組の成果】については、取組前と比べて改善した各種指標や数値なども含めてご記入ください。また、具体的な数値実績を把握していない・取組を始めたばかりでまだ実績が出ていないなどの場合には、記入しなくても構いません。"]
[]
[]
[null,"ID","分類","大項目",null,"小項目",null,null,null,null,null,"関連するSDGsの目標・ターゲット"]
[null,null,null,null,"＊記載してある取組にチェック☑してください（複数選択可）。",null,"3号用項目（項目）","3号用項目（指標例）"]
["環境","E-1","環境マネジメント・コミュニケーション","●自社の事業活動に伴う環境負荷を低減するためのマネジメント体制を構築している。",null,"・継続的に環境面の活動を改善するための環境マネジメント体制を構築している。",{"$f":"D15","v":"●自社の事業活動に伴う環境負荷を低減するためのマネジメント体制を構築している。"},"環境マネジメント体制を構築している事業所の割合（全社に占める売上高、事業所数等の比率）等",false,2,{"$f":"IFERROR(VLOOKUP(TRUE,I15:J15,2,FALSE),0)","v":0},"6.3、7.2、7.3、8.4、11.6、12.2、12.4、12.5、12.6、13.2、14.1、14.3、15.1、15.2"]
["環境",null,null,null,null,"・「ISO14001」、「エコアクション21」、「KES（環境マネジメントスタンダード）」など、環境マネジメントシステムに関する認証を取得している。",{"$f":"D15","v":"●自社の事業活動に伴う環境負荷を低減するためのマネジメント体制を構築している。"},"環境マネジメント体制を構築している事業所の割合（全社に占める売上高、事業所数等の比率）等",false,1,{"$f":"IFERROR(VLOOKUP(TRUE,I16:J16,2,FALSE),0)","v":0},"6.3、7.2、7.3、8.4、11.6、12.2、12.4、12.5、12.6、13.2、14.1、14.3、15.1、15.2"]
["環境",null,null,"●自社の環境への取組を開示している。",null,"・ホームページ、環境報告書、CSR報告書などで自社の取組を公開している。",{"$f":"D17","v":"●自社の環境への取組を開示している。"},"環境への取組の開示にあたり、更新した情報数、更新頻度等",false,1,0,12.6]
["環境","E-2","気候変動（脱炭素）への\n取組","●脱炭素に向けて、省エネに取り組んでいる。",null,"・省エネ型設備への更新や燃料転換などを実施している。",{"$f":"D18","v":"●脱炭素に向けて、省エネに取り組んでいる。"},"省エネ活動の実施件数、エネルギー使用原単位の削減率等",false,1,0,"7.3、8.4、9.4、13.2"]
[null,null,null,null,null,"・低公害車・EV・燃料電池車等を導入している。",{"$f":"D18","v":"●脱炭素に向けて、省エネに取り組んでいる。"},"EV等の導入件数、燃費削減率等",false,1,0,"7.3、8.4、9.4、13.2"]
["環境",null,null,null,null,"・省エネ運動や節電活動などを実施している。",{"$f":"D18","v":"●脱炭素に向けて、省エネに取り組んでいる。"},"省エネ運動の実施件数、電力使用原単位の削減率、社員の省エネ意識の向上率等",false,1,0,"7.3、8.4、13.2"]
[null,null,null,"●脱炭素に向けて、再生可能エネルギーの利用を進めている。",null,"・太陽光発電、風力発電、バイオマス発電等を導入（自家消費）している。",{"$f":"D21","v":"●脱炭素に向けて、再生可能エネルギーの利用を進めている。"},"再生可能エネルギーの導入量等",false,2,0,"7.2、9.4、13.2"]
[null,null,null,null,null,"・再生可能エネルギーによる電力や証書（グリーン電力証書、J-クレジット、非化石証書等）を購入している。",{"$f":"D21","v":"●脱炭素に向けて、再生可能エネルギーの利用を進めている。"},"再生可能エネルギーの購入量等",false,2,0,"7.2、13.2"]
["環境","E-3","水の効率的な\n利用・管理","●自社の事業活動において、水の効率的な利用・管理を行っている",null,"・雨水・中水の再利用や節水を促進している。",{"$f":"D23","v":"●自社の事業活動において、水の効率的な利用・管理を行っている"},"節水活動等の実施件数、水使用原単位の削減率等",false,1,0,"6.1、6.4"]
["環境",null,null,null,null,"・事業所からの排水・汚水による水質汚濁防止に向け、法定を上回る取組がある。",{"$f":"D23","v":"●自社の事業活動において、水の効率的な利用・管理を行っている"},"法定を上回る水質汚濁防止対策の実施件数等",false,1,0,6.3]
["環境","E-4","廃棄物・有害化学物質の管理・３Rの推進","●自社の事業活動において、廃棄物・有害化学物質を適切に管理している。",null,"・リデュース、リユース、リサイクルの推進を行っている。",{"$f":"D25","v":"●自社の事業活動において、廃棄物・有害化学物質を適切に管理している。"},"廃棄物のリサイクル率等",false,1,0,"11.6、12.3、12.4、12.5"]
["環境",null,null,null,null,"・法令等で規制されている有害化学物質を把握し、使用量の削減及び適切な使用に努めている。",{"$f":"D25","v":"●自社の事業活動において、廃棄物・有害化学物質を適切に管理している。"},"化学物質の適切な管理のための対策の実施件数等",false,1,0,"3.9、12.4"]
["環境","E-5","天然資源・\n生物多様性\nへの配慮","●自社の事業活動において、天然資源や生物多様性へ配慮している。",null,"・天然資源の持続的利用に配慮した調達を行っている（例：違法伐採などがない認証ラベルの付いた木材・木材製品を調達している、持続可能で環境に配慮している食材を調達している）。",{"$f":"D27","v":"●自社の事業活動において、天然資源や生物多様性へ配慮している。"},"天然資源に配慮した製品の調達率等",false,1,0,"12.2、14.4、15.2"]
["環境",null,null,null,null,"・事業活動に際して、生物の生息地・希少種の保全・在来種への配慮を行っている（例：外来種の駆除活動を行っている、敷地内等にビオトープを整備している）。",{"$f":"D27","v":"●自社の事業活動において、天然資源や生物多様性へ配慮している。"},"植林・植樹や里山保全活動への参加数、関わった社員の数等",false,1,0,"14.2、15.1、15.4、15.5、15.7、15.8、15.9"]
["環境",null,null,null,null,"・森林の適切な維持・管理に関する取組を行っている（例：里山保全活動に参加している）。",{"$f":"D25","v":"●自社の事業活動において、廃棄物・有害化学物質を適切に管理している。"},"植林・植樹や里山保全活動への参加数、関わった社員の数等",false,1,0,"15.1、15.2、15.3、15.4、15.5、15.8"]
["環境",null,null,null,null,"・海洋プラスチック汚染の防止や海洋護岸保護などに関する活動を行っている。",{"$f":"D25","v":"●自社の事業活動において、廃棄物・有害化学物質を適切に管理している。"},"植林・植樹や里山保全活動への参加数、関わった社員の数等",false,1,{"$f":"IFERROR(VLOOKUP(TRUE,I30:J30,2,FALSE),0)","v":0},"14.1、14.2、14.3、14.4、14.5"]
["環境",null,null,null,null,"・各種エコラベルや「あいち生物多様性企業認証」など、自社の事業において天然資源や生物多様性の保全に資する認証を取得している。",{"$f":"D26","v":0},"植林・植樹や里山保全活動への参加数、関わった社員の数等",false,2,0,"14、15"]
["環境","E-6","製品・サービスを通じた環境問題の解決","●製品・サービスの提供を通じて、環境問題の改善に貢献している。",null,"・省エネルギー、再生可能エネルギー促進、廃棄物削減、リサイクル、生物多様性保全、海洋プラスチック汚染防止など、大気、水質、土壌の汚染防止や浄化につながる技術・製品を提供している。（※製品・サービスを構成する、各種部品等の企業間取引も含む）",{"$f":"D32","v":"●製品・サービスの提供を通じて、環境問題の改善に貢献している。"},"製品ライフサイクルを通じたCO2排出量等（例：製品使用時のCO2排出量の削減率等）",false,2,0,"6、7、9.4、11.5、11.6、12.4、12.5、13、14、15"]
[null,null,null,null,null,"・上記の様な製品・サービスの開発や提供にあたって、産官学や異業種との連携に取り組んでいる",{"$f":"D33","v":0},null,false,2,0,17.170000000000002]
["社会","S-1","労働安全衛生･健康経営","●職場における安全・衛生管理に取り組んでいる。",null,"・作業中の事故等を防ぐための職場の安全対策ルールがある。",{"$f":"D34","v":"●職場における安全・衛生管理に取り組んでいる。"},"安全対策ルールの認知度、労働災害発生件数・労働災害度数率等",false,1,0,8.8000000000000007]
["社会",null,null,null,null,"・安全衛生優良企業公表制度認定（厚生労働省）を取得している。",{"$f":"D34","v":"●職場における安全・衛生管理に取り組んでいる。"},"認定取得の維持、労働災害発生件数・労働災害度数率等",false,1,0,"3.4、8.5、8.8"]
["社会",null,null,null,null,"・ISO45001・OHSAS18001など、労働安全衛生に関する認証を取得している。",{"$f":"D34","v":"●職場における安全・衛生管理に取り組んでいる。"},"認証取得の維持、労働災害発生件数・労働災害度数率等",false,2,0,"3.4、8.5、8.8"]
["社会",null,null,"●健康経営に取り組んでいる。",null,"・長時間労働を抑制する取組がある。",{"$f":"D37","v":"●健康経営に取り組んでいる。"},"時間外労働時間の削減率等",false,1,0,"3.4、8.5"]
["社会",null,null,null,null,"・社員の健康促進のための活動(福利厚生でのジム利用助成など)を実施している。",{"$f":"D37","v":"●健康経営に取り組んでいる。"},"社員の健康促進のための活動や、整備した制度の数等",false,1,0,"3.4、3.8"]
["社会",null,null,null,null,"・従業員向けに、メンタルヘルスの意識啓発や、カウンセラーなどへの相談体制の整備などを行っている。",{"$f":"D37","v":"●健康経営に取り組んでいる。"},"メンタルヘルス研修の受講者数・受講率等",false,1,0,"3.4、3.8"]
["社会",null,null,null,null,"・「健康経営優良法人」などを取得している。",{"$f":"D37","v":"●健康経営に取り組んでいる。"},"メンタルヘルス不調者の発生率・不調後の復帰率等",false,2,0,"3.4、3.8"]
{"$rows_left_out":54}
{"sheet":"公表用チェックシート","index":1,"n_rows":129,"n_cols":14,"rows_kept":129,"cut":false,"hidden":true,"merged":[[14,1,16,1],[14,2,16,2],[14,3,15,3],[13,4,13,5],[12,12,13,13],[12,4,12,5],[12,11,13,11],[24,5,25,5],[26,1,29,1],[26,2,29,2],[26,3,29,3],[23,1,25,1],[23,2,25,2],[23,3,25,3],[21,5,22,5],[20,3,22,3],[17,1,22,1],[17,2,22,2],[17,3,19,3],[27,12,29,12],[26,13,29,13],[21,4,22,4],[14,13,16,13],[23,13,25,13],[42,3,45,3],[39,1,45,1],[39,2,45,2],[39,3,41,3],[36,5,38,5],[35,1,38,1],[35,2,38,2],[35,3,38,3],[27,5,29,5],[30,1,33,1],[30,2,33,2],[30,3,33,3],[57,1,60,1],[57,2,60,2],[57,3,60,3],[54,3,56,3],[51,1,56,1],[51,2,56,2],[51,3,53,3],[46,1,50,1],[46,2,50,2],[46,3,49,3],[70,3,71,3],[68,1,71,1],[68,2,71,2],[68,3,69,3],[65,1,67,1],[65,2,67,2],[65,3,67,3],[62,5,64,5],[61,1,64,1],[61,2,64,2],[61,3,64,3],[84,2,85,2],[84,3,85,3],[80,1,83,1],[80,2,83,2],[80,3,83,3],[75,5,76,5],[77,1,79,1],[77,2,79,2],[77,3,79,3],[72,1,76,1],[72,2,76,2],[72,3,76,3],[128,1,128,3],[128,4,128,6],[100,1,105,1],[100,2,105,2],[100,3,105,3],[97,3,99,3],[96,1,99,1],[96,2,99,2],[86,2,90,2],[86,3,88,3],[89,13,90,13],[86,1,90,1],[102,4,105,4],[75,12,76,12],[94,12,95,12],[94,13,95,13],[102,12,105,12],[72,13,75,13],[100,13,105,13],[86,13,88,13],[91,13,92,13],[97,13,99,13],[94,4,95,4],[94,1,95,1],[94,2,95,2],[94,3,95,3],[94,5,95,5],[91,1,92,1],[91,2,92,2],[91,3,92,3],[89,3,90,3],[89,12,90,12],[102,5,105,5],[84,1,85,1],[36,12,38,12],[62,12,64,12],[57,13,60,13],[34,13,38,13],[46,13,50,13],[2,1,2,13],[77,13,79,13],[80,13,83,13],[84,13,85,13],[61,13,64,13],[17,13,22,13],[39,13,41,13],[42,13,45,13],[51,13,53,13],[54,13,56,13],[65,13,67,13],[68,13,71,13],[24,4,25,4],[27,4,29,4],[36,4,38,4],[62,4,64,4],[30,13,33,13],[21,12,22,12],[24,12,25,12]]}
[]
[]
[null,{"$f":"#REF!&\" のお取組\"","v":{"$error":"#REF!"}}]
[]
[]
[]
[]
[]
[]
[]
[null,null,null,null,null,null,null,null,true]
[null,null,null,null,null,null,null,null,false]
[null,"ID","分類","項目","取組の具体例",null,null,null,false,null,null,"選択番号","関連するSDGsの目標・ターゲット"]
[null,null,null,null,"＊記載してある取組にチェック☑してください（複数選択可）。",null,"3号用項目（項目）","3号用項目（指標例）",false]
["環境","E-1","環境マネジメント・コミュニケーション","●自社の事業活動に伴う環境負荷を低減するためのマネジメント体制を構築している。",null,"・継続的に環境面の活動を改善するための環境マネジメント体制を構築している。",{"$f":"D15","v":"●自社の事業活動に伴う環境負荷を低減するためのマネジメント体制を構築している。"},"環境マネジメント体制を構築している事業所の割合（全社に占める売上高、事業所数等の比率）等",false,1,null,null,"6.3、7.2、7.3、8.4、11.6、12.2、12.4、12.5、12.6、13.2、14.1、14.3、15.1、15.2"]
["環境",null,null,null,null,"・「ISO14001」、「エコアクション21」、「KES（環境マネジメントスタンダード）」など、環境マネジメントシステムに関する認証を取得している。",{"$f":"D15","v":"●自社の事業活動に伴う環境負荷を低減するためのマネジメント体制を構築している。"},"環境マネジメント体制を構築している事業所の割合（全社に占める売上高、事業所数等の比率）等",false,1,null,null,"6.3、7.2、7.3、8.4、11.6、12.2、12.4、12.5、12.6、13.2、14.1、14.3、15.1、15.2"]
["環境",null,null,"●自社の環境への取組を開示している。",null,"・ホームページ、環境報告書、CSR報告書などで自社の取組を公開している。",{"$f":"D17","v":"●自社の環境への取組を開示している。"},"環境への取組の開示にあたり、更新した情報数、更新頻度等",false,1,null,null,12.6]
["環境","E-2","気候変動（脱炭素）への\n取組","●脱炭素に向けて、省エネに取り組んでいる。",null,"・省エネ型設備への更新や燃料転換などを実施している。",{"$f":"D18","v":"●脱炭素に向けて、省エネに取り組んでいる。"},"省エネ活動の実施件数、エネルギー使用原単位の削減率等",false,1,null,null,"7.3、8.4、9.4、13.2"]
[null,null,null,null,null,"・低公害車・EV・燃料電池車等を導入している。",{"$f":"D18","v":"●脱炭素に向けて、省エネに取り組んでいる。"},"EV等の導入件数、燃費削減率等",false,1,null,null,"7.3、8.4、9.4、13.2"]
["環境",null,null,null,null,"・省エネ運動や節電活動などを実施している。",{"$f":"D18","v":"●脱炭素に向けて、省エネに取り組んでいる。"},"省エネ運動の実施件数、電力使用原単位の削減率、社員の省エネ意識の向上率等",false,1,null,null,"7.3、8.4、13.2"]
[null,null,null,"●脱炭素に向けて、再生可能エネルギーの利用を進めている。",null,"・太陽光発電、風力発電、バイオマス発電等を導入（自家消費）している。",{"$f":"D21","v":"●脱炭素に向けて、再生可能エネルギーの利用を進めている。"},"再生可能エネルギーの導入量等",false,1,null,null,"7.2、9.4、13.2"]
[null,null,null,null,null,"・再生可能エネルギーによる電力や証書（グリーン電力証書、J-クレジット、非化石証書等）を購入している。",{"$f":"D21","v":"●脱炭素に向けて、再生可能エネルギーの利用を進めている。"},"再生可能エネルギーの購入量等",false,1,null,null,"7.2、13.2"]
[null,null,null,null,null,null,null,null,false]
["環境","E-3","水の効率的な\n利用・管理","●自社の事業活動において、水の効率的な利用・管理を行っている",null,"・雨水・中水の再利用や節水を促進している。",{"$f":"D24","v":"●自社の事業活動において、水の効率的な利用・管理を行っている"},"節水活動等の実施件数、水使用原単位の削減率等",false,1,null,null,"6.1、6.4"]
["環境",null,null,null,null,"・事業所からの排水・汚水による水質汚濁防止に向け、法定を上回る取組がある。",{"$f":"D24","v":"●自社の事業活動において、水の効率的な利用・管理を行っている"},"法定を上回る水質汚濁防止対策の実施件数等",false,1,null,null,6.3]
[null,null,null,null,null,null,null,null,false]
["環境","E-4","廃棄物・有害化学物質の管理・３Rの推進","●自社の事業活動において、廃棄物・有害化学物質を適切に管理している。",null,"・リデュース、リユース、リサイクルの推進を行っている。",{"$f":"D27","v":"●自社の事業活動において、廃棄物・有害化学物質を適切に管理している。"},"廃棄物のリサイクル率等",false,1,null,null,"11.6、12.3、12.4、12.5"]
["環境",null,null,null,null,"・法令等で規制されている有害化学物質を把握し、使用量の削減及び適切な使用に努めている。",{"$f":"D27","v":"●自社の事業活動において、廃棄物・有害化学物質を適切に管理している。"},"化学物質の適切な管理のための対策の実施件数等",false,1,null,null,"3.9、12.4"]
[null,null,null,null,null,null,null,null,false]
[null,null,null,null,null,null,null,null,false]
["環境","E-5","天然資源・\n生物多様性\nへの配慮","●自社の事業活動において、天然資源や生物多様性へ配慮している。",null,"・天然資源の持続的利用に配慮した調達を行っている（例：違法伐採などがない認証ラベルの付いた木材・木材製品を調達している、持続可能で環境に配慮している食材を調達している）。",{"$f":"D31","v":"●自社の事業活動において、天然資源や生物多様性へ配慮している。"},"天然資源に配慮した製品の調達率等",false,1,null,null,"12.2、14.4、15.2"]
["環境",null,null,null,null,"・事業活動に際して、生物の生息地・希少種の保全・在来種への配慮を行っている（例：外来種の駆除活動を行っている、敷地内等にビオトープを整備している）。",{"$f":"D31","v":"●自社の事業活動において、天然資源や生物多様性へ配慮している。"},"植林・植樹や里山保全活動への参加数、関わった社員の数等",false,1,null,null,"14.2、15.1、15.4、15.5、15.7、15.8、15.9"]
["環境",null,null,null,null,"森林の適切な維持・管理を行っている（例：里山保全活動に参加している）。",{"$f":"D27","v":"●自社の事業活動において、廃棄物・有害化学物質を適切に管理している。"},"植林・植樹や里山保全活動への参加数、関わった社員の数等",false,1,null,null,"15.1、15.2、15.3、15.4、15.5、15.8"]
["環境",null,null,null,null,"・海洋プラスチック汚染の防止や海洋護岸保護などに関する活動を行っている。",{"$f":"D28","v":0},"植林・植樹や里山保全活動への参加数、関わった社員の数等",false,1,null,null,"14.1、14.2、14.3、14.4、14.5"]
[null,null,null,null,null,"・各種エコラベルや「あいち生物多様性企業認証」など、自社の事業において天然資源や生物多様性の保全に資する認証を取得している。",null,null,null,null,null,null,"14、15"]
["環境","E-6","製品・サービスを通じた環境問題の解決","●製品・サービスの提供を通じて、環境問題の改善に貢献している。",null,"・省エネルギー、再生可能エネルギー促進、廃棄物削減、リサイクル、生物多様性保全、海洋プラスチック汚染防止など、大気、水質、土壌の汚染防止や浄化につながる技術・製品を提供している。（※製品・サービスを構成する、各種部品等の企業間取引も含む）",{"$f":"D36","v":"●製品・サービスの提供を通じて、環境問題の改善に貢献している。"},"製品ライフサイクルを通じたCO2排出量等（例：製品使用時のCO2排出量の削減率等）",false,1,null,null,"6、7、9.4、11.5、11.6、12.4、12.5、13、14、15"]
[null,null,null,null,null,"・上記の技術・製品の開発や提供にあたって、産官学や異業種との連携に取り組んでいる",null,null,false,null,null,null,17.170000000000002]
[null,null,null,null,null,null,null,null,false]
[]
["社会","S-1","労働安全衛生･健康経営","●職場における安全・衛生管理に取り組んでいる。",null,"・作業中の事故等を防ぐための職場の安全対策ルールがある。",{"$f":"D40","v":"●職場における安全・衛生管理に取り組んでいる。"},"安全対策ルールの認知度、労働災害発生件数・労働災害度数率等",false,1,null,null,8.8000000000000007]
{"$rows_left_out":90}
{"sheet":"（非表示シート）BCI列プルダウン","index":2,"n_rows":48,"n_cols":10,"rows_kept":48,"cut":false,"hidden":true,"merged":[]}
[null,"B列　ID・分類",null,"C列　ID・分類","D列1","D列2",null,"D列9行",null,"ゴール"]
[null,"TY-E-1　環境マネジメント・コミュニケーション",null,"E-1　環境マネジメント・コミュニケーション","●環境マネジメント体制を構築している。","●自社の環境への取り組みを開示している。",null,{"$f":"IF(#REF!=\"\",\"\",VLOOKUP(#REF!,$D$2:$F$48,2,FALSE))","v":{"$error":"#REF!"}},null,"1　貧困をなくそう"]
[null,"TY-E-2　気候変動（脱炭素）への取り組み",null,"E-2　気候変動（脱炭素）への取り組み","●脱炭素に向けて、省エネに取り組んでいる。","●脱炭素に向けて再生可能エネルギーの利用を進めている。",null,{"$f":"IF(#REF!=\"\",\"\",VLOOKUP(#REF!,$D$2:$F$48,3,FALSE))","v":{"$error":"#REF!"}},null,"2　飢餓をゼロに"]
[null,"TY-E-3　水の効率的な利用・管理",null,"E-3　水の効率的な利用・管理","●水の効率的な利用・管理を行っている"," ",null,null,null,"3　すべての人に健康と福祉を"]
[null,"TY-E-4　廃棄物・有害化学物質の管理・３Rの推進",null,"E-4　廃棄物・有害化学物質の管理・３Rの推進","●廃棄物・有害化学物質を適切に管理している。"," ",null,"D列10行",null,"4　質の高い教育をみんなに"]
[null,"TY-E-5　天然資源・生物多様性への配慮",null,"E-5　天然資源・生物多様性への配慮","●天然資源や生物多様性へ配慮している。"," ",null,{"$f":"IF(#REF!=\"\",\"\",VLOOKUP(#REF!,$D$2:$F$48,2,FALSE))","v":{"$error":"#REF!"}},null,"5　ジェンダー平等を実現しよう"]
[null,"TY-E-6　製品・サービスを通じた環境問題の解決",null,"E-6　製品・サービスを通じた環境問題の解決","●製品・サービスの提供を通じて環境問題の改善に貢献している。"," ",null,{"$f":"IF(#REF!=\"\",\"\",VLOOKUP(#REF!,$D$2:$F$48,3,FALSE))","v":{"$error":"#REF!"}},null,"6　安全な水とトイレを世界中に"]
[null,"TY-S-1　安全・衛生管理、健康経営",null,"S-1　安全・衛生管理、健康経営","●職場における安全・衛生管理に取り組んでいる。","●健康経営に取り組んでいる",null,null,null,"7　エネルギーをみんなに そしてクリーンに"]
[null,"TY-S-2　多様な人材の活躍",null,"S-2　多様な人材の活躍","●外国人、障がい者、高齢者等、社内の多様な人材の活躍支援に関する取り組みがある。","●社内のハラスメントを防止するための取り組みを進めている。",null,"D列11行",null,"8　働きがいも経済成長も"]
[null,"TY-S-3　女性の活躍促進",null,"S-3　女性の活躍促進","●女性の活躍支援に向けた目標を設定している。","●女性の活躍を支援するための取り組みがある。",null,{"$f":"IF(#REF!=\"\",\"\",VLOOKUP(#REF!,$D$2:$F$48,2,FALSE))","v":{"$error":"#REF!"}},null,"9　産業と技術革新の基盤をつくろう"]
[null,"TY-S-4　多様な働き方の促進",null,"S-4　多様な働き方の促進","●多様な働き方を促進するための取り組みがある。"," ",null,{"$f":"IF(#REF!=\"\",\"\",VLOOKUP(#REF!,$D$2:$F$48,3,FALSE))","v":{"$error":"#REF!"}},null,"10　人や国の不平等をなくそう"]
[null,"TY-S-5　従業員の人材育成・能力強化",null,"S-5　従業員の人材育成・能力強化","●従業員に能力開発、教育訓練の機会や人材育成のための仕組みを提供している。"," ",null,null,null,"11　住み続けられるまちづくりを"]
[null,"TY-S-6　サプライヤーへの配慮",null,"S-6　サプライヤーへの配慮","●サプライヤー（取引先）の事業活動や環境・社会への取り組みを理解し、サプライチェーン全体で社会的責任を果たすために取り組んでいる。"," ",null,null,null,"12　つくる責任つかう責任"]
[null,"TY-S-7　顧客に対する配慮",null,"S-7　顧客に対する配慮","●顧客からの要望を聞き入れ・改善するための体制を整備している。","●品質管理に関する取り組みを行っている",null,null,null,"13　気候変動に具体的な対策を"]
[null,"TY-S-8　製品・サービスを通じた社会課題の解決",null,"S-8　製品・サービスを通じた社会課題の解決","●製品・サービスの提供を通じて社会課題の解決に貢献している。"," ",null,null,null,"14　海の豊かさを守ろう"]
[null,"TY-G-1　公正な経済取引",null,"G-1　公正な経済取引","●公正な経済取引を行っている。",null,null,null,null,"15　陸の豊かさも守ろう"]
[null,"TY-G-2　情報セキュリティ",null,"G-2　情報セキュリティ","●情報セキュリティ対策を行っている",null,null,null,null,"16　平和と公正をすべての人に"]
[null,"TY-G-3　企業統治体制の構築",null,"G-3　企業統治体制の構築","●企業統治体制を構築している。",null,null,null,null,"17　パートナーシップで目標を達成しよう"]
[null,"TY-G-4　企業の社会的責任",null,"G-4　企業の社会的責任","●事業によって社会・環境に及ぼす影響に対し、責任を持って対応している。","●SDGsの各種取組を戦略的・持続的に推進する基盤を整備している。"]
[null,"TY-G-5　事業継続と事業継承",null,"G-5　事業継続と事業継承","●事業継続や事業継承に関する取り組みが進められている。"]
[null,"TY-L-1　豊田市内における雇用促進",null,"L-1　豊田における雇用促進","●従業員の1/2以上が豊田市民である (非正規・パートを含む)"," "]
[null,"TY-L-2　豊田市の施策・事業への協力",null,"L-2　豊田市内の地域コミュニティへの配慮","●市の施策・事業に協力している。"]
[null,"TY-L-3　豊田市内の地域コミュニティへの配慮",null,"L-3　豊田における文化・芸術活動の促進","●地域課題解決に向けた事業や取組を行っている。"," ●地域社会とのコミュニケーション機会を設けている。"]
[null,"TY-L-4　製品・サービスを通じた地域問題の解決",null,"L-4　製品・サービスを通じた地域問題の解決","●地域経済に資する製品・サービスを提供している。"," "]
[null,"B列　ID・分類",null,"B列　ID・分類","C列1","C列2",null,{"$f":"IF(#REF!=\"\",\"\",VLOOKUP(#REF!,$D$2:$F$48,2,FALSE))","v":{"$error":"#REF!"}}]
[null,"TY-S-1　安全・衛生管理、健康経営",null,"TY-S-1　安全・衛生管理、健康経営","●職場における安全・衛生管理に取り組んでいる。","●健康経営に取り組んでいる",null,{"$f":"IF(#REF!=\"\",\"\",VLOOKUP(#REF!,$D$2:$F$48,2,FALSE))","v":{"$error":"#REF!"}}]
[null,"TY-S-2　多様な人材の活躍",null,"TY-S-2　多様な人材の活躍","●外国人、障がい者、高齢者等、社内の多様な人材の活躍支援に関する取り組みがある。","●社内のハラスメントを防止するための取り組みを進めている。"]
[null,"TY-S-3　女性の活躍促進",null,"TY-S-3　女性の活躍促進","●女性の活躍支援に向けた目標を設定している。","●女性の活躍を支援するための取り組みがある。"]
[null,"TY-S-4　多様な働き方の促進",null,"TY-S-4　多様な働き方の促進","●多様な働き方を促進するための取り組みがある。"," "]
[null,"TY-S-5　従業員の人材育成・能力強化",null,"TY-S-5　従業員の人材育成・能力強化","●従業員に能力開発、教育訓練の機会や人材育成のための仕組みを提供している。"," "]
[null,"TY-S-6　サプライヤーへの配慮",null,"TY-S-6　サプライヤーへの配慮","●サプライヤー（取引先）の事業活動や環境・社会への取り組みを理解し、サプライチェーン全体で社会的責任を果たすために取り組んでいる。"," "]
[null,"TY-S-7　顧客に対する配慮",null,"TY-S-7　顧客に対する配慮","●顧客からの要望を聞き入れ・改善するための体制を整備している。","●品質管理に関する取り組みを行っている"]
[null,"TY-S-8　製品・サービスを通じた社会課題の解決",null,"TY-S-8　製品・サービスを通じた社会課題の解決","●製品・サービスの提供を通じて社会課題の解決に貢献している。"," "]
[]
[null,null,null,null,null,null,null,"C列14行"]
[null,"B列　ID・分類",null,"B列　ID・分類","C列1","C列2",null,""]
[null,"TY-G-1　公正な経済取引",null,"TY-G-1　公正な経済取引","●公正な経済取引を行っている。"]
[null,"TY-G-2　情報セキュリティ",null,"TY-G-2　情報セキュリティ","●情報セキュリティ対策を行っている"]
[null,"TY-G-3　企業統治体制の構築",null,"TY-G-3　企業統治体制の構築","●企業統治体制を構築している。"]
[null,"TY-G-4　企業の社会的責任",null,"TY-G-4　企業の社会的責任","●事業によって社会・環境に及ぼす影響に対し、責任を持って対応している。","●SDGsの各種取組を戦略的・持続的に推進する基盤を整備している。"]
{"$rows_left_out":8}